$# LS-DYNA Keyword file created by LS-PrePost(R) V4.6.1 - 04Dec2018
$# Created on Dec-31-2018 (12:24:26)
*KEYWORD MEMORY=25000000
*TITLE
$#                                                                         title
Beam Tutorial
*CONTROL_ACCURACY
*CONTROL_IMPLICIT_AUTO
*CONTROL_IMPLICIT_GENERAL
*CONTROL_IMPLICIT_SOLUTION
*CONTROL_IMPLICIT_SOLVER
*CONTROL_TERMINATION
*DATABASE_BNDOUT
*DATABASE_ELOUT
*DATABASE_SECFORC
*DATABASE_SPCFORC
*DATABASE_EXTENT_BINARY
*DATABASE_HISTORY_NODE
*DATABASE_HISTORY_SHELL
*BOUNDARY_PRESCRIBED_MOTION_SET
*BOUNDARY_SPC_SET_ID
         1Fixed end
*SET_NODE_LIST_TITLE
NODESET(SPC) 4
         4       0.0       0.0       0.0       0.0MECH
*BOUNDARY_SPC_SET_ID
         2Free end
*SET_NODE_LIST_TITLE
NODESET(SPC) 5
         5       0.0       0.0       0.0       0.0MECH
*DEFINE_CURVE
*INTEGRATION_SHELL
*SET_NODE_LIST_TITLE
NODESET(SPC) 1
         1       0.0       0.0       0.0       0.0MECH
*SET_NODE_LIST
         2       0.0       0.0       0.0       0.0MECH
*SET_NODE_LIST_TITLE
Loads
         3       0.0       0.0       0.0       0.0MECH
*SET_NODE_LIST_TITLE
Load rigid body 6
         6       0.0       0.0       0.0       0.0MECH
*SET_NODE_LIST
         7       0.0       0.0       0.0       0.0MECH
*ELEMENT_SHELL
*NODE
*SECTION_SHELL_TITLE
Section: Used for all lamantes in beam
*SECTION_SHELL_TITLE
Section: for metal stiff ends
*MAT_COMPOSITE_MATRIX_TITLE
[0/90/90/0]s  laminate
*MAT_ELASTIC_TITLE
stiff ends
*PART
*PART
*PART
*PART
ends
*PERTURBATION_NODE
*END