$# LS-DYNA Keyword file created by LS-PrePost(R) V4.6.1 - 04Dec2018
$# Created on Jan-06-2019 (21:21:57)
*KEYWORD
*TITLE
$#                                                                         title
LS-DYNA keyword deck by LS-PrePost
*CONTROL_TERMINATION
$#  endtim    endcyc     dtmin    endeng    endmas     nosol
*DATABASE_BNDOUT
$#      dt    binary      lcur     ioopt
*DATABASE_NODOUT
$#      dt    binary      lcur     ioopt   option1   option2
*DATABASE_RCFORC
$#      dt    binary      lcur     ioopt
*DATABASE_BINARY_D3PLOT
$#      dt      lcdt      beam     npltc    psetid
$#   ioopt
*DATABASE_HISTORY_NODE
$#     id1       id2       id3       id4       id5       id6       id7       id8
*BOUNDARY_PRESCRIBED_MOTION_SET_ID
$#      id                                                               heading
         1Punch velocity
$#    nsid       dof       vad      lcid        sf       vid     death     birth
*BOUNDARY_SPC_SET_ID
$#      id                                                               heading
         1Lower BH fixed
$#    nsid       cid      dofx      dofy      dofz     dofrx     dofry     dofrz
*SET_NODE_LIST_TITLE
NODESET(SPC) 1
$#     sid       da1       da2       da3       da4    solver
         1       0.0       0.0       0.0       0.0MECH
$#    nid1      nid2      nid3      nid4      nid5      nid6      nid7      nid8
*BOUNDARY_SPC_SET_ID
$#      id                                                               heading
         2Top BH lateral constraints
$#    nsid       cid      dofx      dofy      dofz     dofrx     dofry     dofrz
*SET_NODE_LIST_TITLE
NODESET(SPC) 2
$#     sid       da1       da2       da3       da4    solver
         2       0.0       0.0       0.0       0.0MECH
$#    nid1      nid2      nid3      nid4      nid5      nid6      nid7      nid8
*BOUNDARY_SPC_SET_ID
$#      id                                                               heading
         3Punch lateral contraints
$#    nsid       cid      dofx      dofy      dofz     dofrx     dofry     dofrz
*SET_NODE_LIST_TITLE
NODESET(SPC) 3
$#     sid       da1       da2       da3       da4    solver
         3       0.0       0.0       0.0       0.0MECH
$#    nid1      nid2      nid3      nid4      nid5      nid6      nid7      nid8
*BOUNDARY_SPC_SET_ID
$#      id                                                               heading
         0fabric edge
$#    nsid       cid      dofx      dofy      dofz     dofrx     dofry     dofrz
*SET_NODE_LIST
$#     sid       da1       da2       da3       da4    solver
         5       0.0       0.0       0.0       0.0MECH
$#    nid1      nid2      nid3      nid4      nid5      nid6      nid7      nid8
*BOUNDARY_SPC_SET_ID
$#      id                                                               heading
         5center
$#    nsid       cid      dofx      dofy      dofz     dofrx     dofry     dofrz
*SET_NODE_LIST_TITLE
NODESET(SPC) 6
$#     sid       da1       da2       da3       da4    solver
         6       0.0       0.0       0.0       0.0MECH
$#    nid1      nid2      nid3      nid4      nid5      nid6      nid7      nid8
*CONTACT_AUTOMATIC_SURFACE_TO_SURFACE_ID
$#     cid                                                                 title
         1Upper blankholder to fabric
$#    ssid      msid     sstyp     mstyp    sboxid    mboxid       spr       mpr
$#      fs        fd        dc        vc       vdc    penchk        bt        dt
$#     sfs       sfm       sst       mst      sfst      sfmt       fsf       vsf
*SET_SEGMENT_TITLE
Upper blankholder
$#     sid       da1       da2       da3       da4    solver
         1       0.0       0.0       0.0       0.0MECH
$#      n1        n2        n3        n4        a1        a2        a3        a4
*SET_SEGMENT_TITLE
Fabric
$#     sid       da1       da2       da3       da4    solver
         3       0.0       0.0       0.0       0.0MECH
$#      n1        n2        n3        n4        a1        a2        a3        a4
*CONTACT_AUTOMATIC_SURFACE_TO_SURFACE_ID
$#     cid                                                                 title
         5Punch to Fabric
$#    ssid      msid     sstyp     mstyp    sboxid    mboxid       spr       mpr
$#      fs        fd        dc        vc       vdc    penchk        bt        dt
$#     sfs       sfm       sst       mst      sfst      sfmt       fsf       vsf
*SET_SEGMENT_TITLE
Punch
$#     sid       da1       da2       da3       da4    solver
         2       0.0       0.0       0.0       0.0MECH
$#      n1        n2        n3        n4        a1        a2        a3        a4
*CONTACT_AUTOMATIC_SURFACE_TO_SURFACE_ID
$#     cid                                                                 title
         6Lower blankholder to fabric
$#    ssid      msid     sstyp     mstyp    sboxid    mboxid       spr       mpr
$#      fs        fd        dc        vc       vdc    penchk        bt        dt
$#     sfs       sfm       sst       mst      sfst      sfmt       fsf       vsf
*SET_SEGMENT_TITLE
Lower blankholder
$#     sid       da1       da2       da3       da4    solver
         4       0.0       0.0       0.0       0.0MECH
$#      n1        n2        n3        n4        a1        a2        a3        a4
*DEFINE_CURVE_TITLE
Punch velocity
$#    lcid      sidr       sfa       sfo      offa      offo    dattyp     lcint
$#                a1                  o1
*DEFINE_CURVE_TITLE
BH pressure
$#    lcid      sidr       sfa       sfo      offa      offo    dattyp     lcint
$#                a1                  o1
*SET_NODE_LIST_TITLE
Node set 4
$#     sid       da1       da2       da3       da4    solver
         4       0.0       0.0       0.0       0.0MECH
$#    nid1      nid2      nid3      nid4      nid5      nid6      nid7      nid8
*ELEMENT_SHELL
$#   eid     pid      n1      n2      n3      n4      n5      n6      n7      n8
*NODE
$#   nid               x               y               z      tc      rc
*SECTION_SHELL_TITLE
Punch
$#   secid    elform      shrf       nip     propt   qr/irid     icomp     setyp
$#      t1        t2        t3        t4      nloc     marea      idof    edgset
*SECTION_SHELL_TITLE
Fabric
$#   secid    elform      shrf       nip     propt   qr/irid     icomp     setyp
$#      t1        t2        t3        t4      nloc     marea      idof    edgset
*SECTION_SHELL_TITLE
Upper BH
$#   secid    elform      shrf       nip     propt   qr/irid     icomp     setyp
$#      t1        t2        t3        t4      nloc     marea      idof    edgset
*SECTION_SHELL_TITLE
Lower BH
$#   secid    elform      shrf       nip     propt   qr/irid     icomp     setyp
$#      t1        t2        t3        t4      nloc     marea      idof    edgset
$---5---10----5---20----5---30----5---40----5---50----5---60----5---70----5---80
*MAT_ELASTIC
$#     mid        ro         e        pr        da        db  not used
*MAT_FABRIC_TITLE
Fabric
$#     mid        ro        ea        eb         -      prba      prab         -
$#     gab         -         -       cse        el       prl    lratio      damp
$#    aopt       flc       fac       ela      lnrc      form     fvopt    tsrfac
$#  unused    rgbrth     a0ref        a1        a2        a3        x0        x1
$#      v1        v2        v3         -         -         -      beta    isrefg
*LOAD_SEGMENT_SET_ID
$#      id                                                               heading
         1Pressure
$#    ssid      lcid        sf        at
*PART
$#                                                                         title
Punch
$#     pid     secid       mid     eosid      hgid      grav    adpopt      tmid
*PART
$#                                                                         title
Fabric
$#     pid     secid       mid     eosid      hgid      grav    adpopt      tmid
*PART
$#                                                                         title
Upper blankholder
$#     pid     secid       mid     eosid      hgid      grav    adpopt      tmid
*PART
$#                                                                         title
Lower blankholder
$#     pid     secid       mid     eosid      hgid      grav    adpopt      tmid
$
$Unrecognized cards
$
$*CONTACT
$         6         7         0         0         0         0         0         0
$        0.        0.        0.        0.        0.         0        0.        0.
$        1.        1.      1.99        0.        1.        1.        1.        1.
$         0       0.1        0.        0.        0.        2.        0.        1.
$        0.         0                   0         0         0        0.        0.
$*CONTACT
$         8         9         0         0         0         0         0         0
$        0.        0.        0.        0.        0.         0        0.        0.
$        1.        1.      1.99        0.        1.        1.        1.        1.
$         0       0.1        0.        0.        0.        2.        0.        1.
$        0.         0                   0         0         0        0.        0.
$*CONTACT
$        11        12         0         0         0         0         0         0
$        0.        0.        0.        0.        0.         0        0.        0.
$        1.        1.        1.        0.        1.        1.        1.        1.
$         0       0.1        0.        0.        0.        2.        0.        1.
$        0.         0                   0         0         0        0.        0.
*END