$# LS-DYNA Keyword file created by LS-PrePost(R) V4.2 - 09Jan2016(11:00)
$# Created on Apr-04-2016 (13:00:50)
*KEYWORD
*CONTROL_TERMINATION
$#  endtim    endcyc     dtmin    endeng    endmas
*DATABASE_BINARY_D3PLOT
$#      dt      lcdt      beam     npltc    psetid
$#   ioopt
*BOUNDARY_SPC_SET
$#    nsid       cid      dofx      dofy      dofz     dofrx     dofry     dofrz
*SET_NODE_LIST_TITLE
NODESET(SPC) 1
$#     sid       da1       da2       da3       da4    solver
         1       0.0       0.0       0.0       0.0MECH
$#    nid1      nid2      nid3      nid4      nid5      nid6      nid7      nid8
*LOAD_SEGMENT_SET_ID
$#      id                                                               heading
         1Pressure
$#    ssid      lcid        sf        at        dt
*PART
$#                                                                         title
Cube
$#     pid     secid       mid     eosid      hgid      grav    adpopt      tmid
*SECTION_SOLID_TITLE
Cube
$#   secid    elform       aet
*MAT_ELASTIC_TITLE
Steel
$#     mid        ro         e        pr        da        db  not used
*DEFINE_CURVE_TITLE
Curve - Pressure
$#    lcid      sidr       sfa       sfo      offa      offo    dattyp     lcint
$#                a1                  o1
*SET_SEGMENT
$#     sid       da1       da2       da3       da4    solver
         1       0.0       0.0       0.0       0.0MECH
$#      n1        n2        n3        n4        a1        a2        a3        a4
*ELEMENT_SOLID
$#   eid     pid      n1      n2      n3      n4      n5      n6      n7      n8
*NODE
$#   nid               x               y               z      tc      rc
*END