$# LS-DYNA Keyword file created by LS-PrePost(R) V4.6.1 - 04Dec2018
$# Created on Jan-29-2019 (14:40:21)
*KEYWORD
*TITLE
$#                                                                         title
LS-DYNA keyword deck by LS-PrePost
*CONTROL_IMPLICIT_AUTO
*CONTROL_IMPLICIT_GENERAL
*CONTROL_IMPLICIT_SOLUTION
*CONTROL_IMPLICIT_SOLVER
*CONTROL_TERMINATION
*BOUNDARY_SPC_SET
*SET_NODE_LIST_TITLE
NODESET(SPC) 1
         1       0.0       0.0       0.0       0.0MECH
*BOUNDARY_SPC_SET
*SET_NODE_LIST_TITLE
NODESET(SPC) 2
         2       0.0       0.0       0.0       0.0MECH
*DEFINE_CURVE_TITLE
Load curve for load
*SET_NODE_LIST
         3       0.0       0.0       0.0       0.0MECH
*ELEMENT_SHELL
*NODE
*SECTION_SHELL_TITLE
Aluminium plate thk=1
*MAT_ELASTIC_TITLE
Elastic data for plate
*LOAD_NODE_SET
*PART
*END