$# LS-DYNA Keyword file created by LS-PrePost(R) V4.6.1 - 04Dec2018
$# Created on Feb-11-2019 (19:45:06)
*KEYWORD
*TITLE
$#                                                                         title
Elastic failure analysis (Plate with a hole)
*CONTROL_TERMINATION
$#  endtim    endcyc     dtmin    endeng    endmas     nosol
*DATABASE_BNDOUT
$#      dt    binary      lcur     ioopt
*DATABASE_ELOUT
$#      dt    binary      lcur     ioopt   option1   option2   option3   option4
*DATABASE_SECFORC
$#      dt    binary      lcur     ioopt
*DATABASE_BINARY_D3PLOT
$#      dt      lcdt      beam     npltc    psetid
$#   ioopt
*DATABASE_EXTENT_BINARY
$#   neiph     neips    maxint    strflg    sigflg    epsflg    rltflg    engflg
$#  cmpflg    ieverp    beamip     dcomp      shge     stssz    n3thdt   ialemat
$# nintsld   pkp_sen      sclp     hydro     msscl     therm    intout    nodout
$#    dtdt    resplt     neipb     quadr     cubic
*DATABASE_CROSS_SECTION_PLANE_ID
$#    csid                                                                 title
         1section though rear of plate
$#    psid       xct       yct       zct       xch       ych       zch    radius
$#    xhev      yhev      zhev      lenl      lenm        id     itype
*DATABASE_HISTORY_SHELL
$#     id1       id2       id3       id4       id5       id6       id7       id8
*BOUNDARY_PRESCRIBED_MOTION_SET
$#    nsid       dof       vad      lcid        sf       vid     death     birth
*BOUNDARY_SPC_SET
$#    nsid       cid      dofx      dofy      dofz     dofrx     dofry     dofrz
*SET_NODE_LIST_TITLE
boundary nodes
$#     sid       da1       da2       da3       da4    solver
         4       0.0       0.0       0.0       0.0MECH
$#    nid1      nid2      nid3      nid4      nid5      nid6      nid7      nid8
*DEFINE_CURVE_TITLE
Load curve for velocity
$#    lcid      sidr       sfa       sfo      offa      offo    dattyp     lcint
$#                a1                  o1
*SET_NODE_LIST_TITLE
loaded end
$#     sid       da1       da2       da3       da4    solver
         3       0.0       0.0       0.0       0.0MECH
$#    nid1      nid2      nid3      nid4      nid5      nid6      nid7      nid8
*ELEMENT_SHELL
$#   eid     pid      n1      n2      n3      n4      n5      n6      n7      n8
*NODE
$#   nid               x               y               z      tc      rc
*SECTION_SHELL_TITLE
Aluminium plate thk=1
$#   secid    elform      shrf       nip     propt   qr/irid     icomp     setyp
$#      t1        t2        t3        t4      nloc     marea      idof    edgset
*MAT_PIECEWISE_LINEAR_PLASTICITY_TITLE
Aluminium (elasto-plastic with failure)
$#     mid        ro         e        pr      sigy      etan      fail      tdel
$#       c         p      lcss      lcsr        vp
$#    eps1      eps2      eps3      eps4      eps5      eps6      eps7      eps8
$#     es1       es2       es3       es4       es5       es6       es7       es8
*PART
$#                                                                         title
$#     pid     secid       mid     eosid      hgid      grav    adpopt      tmid
*END