$# LS-DYNA Keyword file created by LS-PrePost(R) V4.5.14 - 14Feb2018
$# Created on Oct-15-2018 (12:28:12)
*KEYWORD
*TITLE
$#                                                                         title
Lmainate analysis with failure (4plies 0°)
*CONTROL_TERMINATION
$#  endtim    endcyc     dtmin    endeng    endmas     nosol
*DATABASE_ELOUT
$#      dt    binary      lcur     ioopt   option1   option2   option3   option4
*DATABASE_SECFORC
$#      dt    binary      lcur     ioopt
*DATABASE_BINARY_D3PLOT
$#      dt      lcdt      beam     npltc    psetid
$#   ioopt
*DATABASE_EXTENT_BINARY
$#   neiph     neips    maxint    strflg    sigflg    epsflg    rltflg    engflg
$#  cmpflg    ieverp    beamip     dcomp      shge     stssz    n3thdt   ialemat
$# nintsld   pkp_sen      sclp     hydro     msscl     therm    intout    nodout
$#    dtdt    resplt     neipb     quadr     cubic
*DATABASE_CROSS_SECTION_PLANE_ID
$#    csid                                                                 title
         1section though rear of plate
$#    psid       xct       yct       zct       xch       ych       zch    radius
$#    xhev      yhev      zhev      lenl      lenm        id     itype
*DATABASE_HISTORY_SHELL
$#     id1       id2       id3       id4       id5       id6       id7       id8
*BOUNDARY_PRESCRIBED_MOTION_SET
$#    nsid       dof       vad      lcid        sf       vid     death     birth
*BOUNDARY_SPC_SET
$#    nsid       cid      dofx      dofy      dofz     dofrx     dofry     dofrz
*SET_NODE_LIST_TITLE
boundary nodes
$#     sid       da1       da2       da3       da4    solver
         4       0.0       0.0       0.0       0.0MECH
$#    nid1      nid2      nid3      nid4      nid5      nid6      nid7      nid8
*PART
$#                                                                         title
Ply
$#     pid     secid       mid     eosid      hgid      grav    adpopt      tmid
*SECTION_SHELL_TITLE
laminate thk=1
$#   secid    elform      shrf       nip     propt   qr/irid     icomp     setyp
$#      t1        t2        t3        t4      nloc     marea      idof    edgset
$#      bi        bi        bi        bi        bi        bi        bi        bi
*MAT_ENHANCED_COMPOSITE_DAMAGE_TITLE
0 ply
$#     mid        ro        ea        eb      (ec)      prba    (prca)    (prcb)
$#     gab       gbc       gca      (kf)      aopt      2way
$#      xp        yp        zp        a1        a2        a3    mangle
$#      v1        v2        v3        d1        d2        d3    dfailm    dfails
$#   tfail      alph      soft      fbrt     ycfac    dfailt    dfailc       efs
$#      xc        xt        yc        yt        sc      crit      beta
$#     pel      epsf      epsr      tsmd     soft2
$#  slimt1    slimc1    slimt2    slimc2     slims    ncyred     softg
*DEFINE_CURVE_TITLE
Load curve for load
$#    lcid      sidr       sfa       sfo      offa      offo    dattyp     lcint
$#                a1                  o1
*SET_NODE_LIST_TITLE
loaded end
$#     sid       da1       da2       da3       da4    solver
         3       0.0       0.0       0.0       0.0MECH
$#    nid1      nid2      nid3      nid4      nid5      nid6      nid7      nid8
*INTEGRATION_SHELL
$#    irid       nip      esop   failopt
$#       s        wf       pid
*ELEMENT_SHELL
$#   eid     pid      n1      n2      n3      n4      n5      n6      n7      n8
*NODE
$#   nid               x               y               z      tc      rc
*END