$# LS-DYNA Keyword file created by LS-PrePost(R) V4.6.1 - 04Dec2018
$# Created on Feb-14-2019 (18:12:26)
*KEYWORD MEMORY=25000000
*TITLE
$#                                                                         title
Beam Tutorial
*CONTROL_ACCURACY
$#     osu       inn    pidosu      iacc
*CONTROL_IMPLICIT_AUTO
$#   iauto    iteopt    itewin     dtmin     dtmax     dtexp     kfail    kcycle
*CONTROL_IMPLICIT_GENERAL
$#  imflag       dt0    imform      nsbs       igs     cnstn      form    zero_v
*CONTROL_IMPLICIT_SOLUTION
$#  nsolvr    ilimit    maxref     dctol     ectol     rctol     lstol    abstol
$#   dnorm    diverg     istif   nlprint    nlnorm   d3itctl     cpchk
$#  arcctl    arcdir    arclen    arcmth    arcdmp    arcpsi    arcalf    arctim
$#   lsmtd     lsdir      irad      srad      awgt      sred
*CONTROL_IMPLICIT_SOLVER
$#  lsolvr    lprint     negev     order      drcm    drcprm   autospc   autotol
$#  lcpack    mtxdmp    iparm1    rparm1    rparm2
$#  emxdmp    rdcmem
*CONTROL_TERMINATION
$#  endtim    endcyc     dtmin    endeng    endmas     nosol
*DATABASE_BNDOUT
$#      dt    binary      lcur     ioopt
*DATABASE_ELOUT
$#      dt    binary      lcur     ioopt   option1   option2   option3   option4
*DATABASE_SECFORC
$#      dt    binary      lcur     ioopt
*DATABASE_SPCFORC
$#      dt    binary      lcur     ioopt
*DATABASE_EXTENT_BINARY
$#   neiph     neips    maxint    strflg    sigflg    epsflg    rltflg    engflg
$#  cmpflg    ieverp    beamip     dcomp      shge     stssz    n3thdt   ialemat
$# nintsld   pkp_sen      sclp     hydro     msscl     therm    intout    nodout
$#    dtdt    resplt     neipb     quadr     cubic
*DATABASE_CROSS_SECTION_PLANE_ID
$#    csid                                                                 title
         1section plane
$#    psid       xct       yct       zct       xch       ych       zch    radius
$#    xhev      yhev      zhev      lenl      lenm        id     itype
*DATABASE_HISTORY_NODE
$#     id1       id2       id3       id4       id5       id6       id7       id8
*DATABASE_HISTORY_SHELL
$#     id1       id2       id3       id4       id5       id6       id7       id8
*BOUNDARY_PRESCRIBED_MOTION_SET_ID
$#      id                                                               heading
         1Centre displacements
$#    nsid       dof       vad      lcid        sf       vid     death     birth
*BOUNDARY_SPC_SET_ID
$#      id                                                               heading
         0LH base BC
$#    nsid       cid      dofx      dofy      dofz     dofrx     dofry     dofrz
*SET_NODE_LIST_TITLE
Boundary conditions LH
$#     sid       da1       da2       da3       da4    solver
         1       0.0       0.0       0.0       0.0MECH
$#    nid1      nid2      nid3      nid4      nid5      nid6      nid7      nid8
*BOUNDARY_SPC_SET_ID
$#      id                                                               heading
         0RH base BC
$#    nsid       cid      dofx      dofy      dofz     dofrx     dofry     dofrz
*SET_NODE_LIST_TITLE
Boundary conditions RH
$#     sid       da1       da2       da3       da4    solver
         2       0.0       0.0       0.0       0.0MECH
$#    nid1      nid2      nid3      nid4      nid5      nid6      nid7      nid8
*BOUNDARY_SPC_SET_ID
$#      id                                                               heading
         3New top displacement BC
$#    nsid       cid      dofx      dofy      dofz     dofrx     dofry     dofrz
*SET_NODE_LIST_TITLE
New centre loads
$#     sid       da1       da2       da3       da4    solver
         5       0.0       0.0       0.0       0.0MECH
$#    nid1      nid2      nid3      nid4      nid5      nid6      nid7      nid8
*DEFINE_CURVE
$#    lcid      sidr       sfa       sfo      offa      offo    dattyp     lcint
$#                a1                  o1
*INTEGRATION_SHELL
$#    irid       nip      esop   failopt
$#       s        wf       pid
*SET_NODE_LIST_TITLE
Old line loads
$#     sid       da1       da2       da3       da4    solver
         3       0.0       0.0       0.0       0.0MECH
$#    nid1      nid2      nid3      nid4      nid5      nid6      nid7      nid8
*SET_NODE_LIST_TITLE
New center loads
$#     sid       da1       da2       da3       da4    solver
         4       0.0       0.0       0.0       0.0MECH
$#    nid1      nid2      nid3      nid4      nid5      nid6      nid7      nid8
*ELEMENT_SHELL
$#   eid     pid      n1      n2      n3      n4      n5      n6      n7      n8
*NODE
$#   nid               x               y               z      tc      rc
$  11659          1000.0             0.0            60.0       5       6
$  11660             0.0             0.0            60.0       7       5
*SECTION_SHELL
$#   secid    elform      shrf       nip     propt   qr/irid     icomp     setyp
$#      t1        t2        t3        t4      nloc     marea      idof    edgset
$#      bi        bi        bi        bi        bi        bi        bi        bi
*SECTION_SHELL
$#   secid    elform      shrf       nip     propt   qr/irid     icomp     setyp
$#      t1        t2        t3        t4      nloc     marea      idof    edgset
*MAT_ENHANCED_COMPOSITE_DAMAGE_TITLE
Ply data   IM7/8551-7
$#     mid        ro        ea        eb      (ec)      prba    (prca)    (prcb)
$#     gab       gbc       gca      (kf)      aopt      2way
$#      xp        yp        zp        a1        a2        a3    mangle
$#      v1        v2        v3        d1        d2        d3    dfailm    dfails
$#   tfail      alph      soft      fbrt     ycfac    dfailt    dfailc       efs
$#      xc        xt        yc        yt        sc      crit      beta
$#     pel      epsf      epsr      tsmd     soft2
$#  slimt1    slimc1    slimt2    slimc2     slims    ncyred     softg
*MAT_ELASTIC_TITLE
stiff ends
$#     mid        ro         e        pr        da        db  not used
*PART
$#                                                                         title
$#     pid     secid       mid     eosid      hgid      grav    adpopt      tmid
*PART
$#                                                                         title
$#     pid     secid       mid     eosid      hgid      grav    adpopt      tmid
*PART
$#                                                                         title
$#     pid     secid       mid     eosid      hgid      grav    adpopt      tmid
*PART
$#                                                                         title
ends
$#     pid     secid       mid     eosid      hgid      grav    adpopt      tmid
*END