$# LS-DYNA Keyword file created by LS-PrePost(R) V4.6.1 - 04Dec2018
$# Created on Dec-20-2018 (23:08:40)
*KEYWORD MEMORY=25000000
*TITLE
$#                                                                         title
Beam Tutorial
*CONTROL_ACCURACY
*CONTROL_IMPLICIT_AUTO
*CONTROL_IMPLICIT_GENERAL
*CONTROL_IMPLICIT_SOLUTION
*CONTROL_IMPLICIT_SOLVER
*CONTROL_TERMINATION
*DATABASE_BNDOUT
*DATABASE_ELOUT
*DATABASE_SECFORC
*DATABASE_SPCFORC
*DATABASE_EXTENT_BINARY
*DATABASE_CROSS_SECTION_PLANE_ID
         1section plane
*DATABASE_HISTORY_NODE
*DATABASE_HISTORY_SHELL
*BOUNDARY_PRESCRIBED_MOTION_SET
*BOUNDARY_SPC_SET
*SET_NODE_LIST_TITLE
NODESET(SPC) 1
         1       0.0       0.0       0.0       0.0MECH
*BOUNDARY_SPC_SET
*SET_NODE_LIST
         2       0.0       0.0       0.0       0.0MECH
*BOUNDARY_SPC_SET
*SET_NODE_LIST_TITLE
NODESET(SPC) 5
         5       0.0       0.0       0.0       0.0MECH
*DEFINE_CURVE
*INTEGRATION_SHELL
*SET_NODE_LIST_TITLE
Loads
         3       0.0       0.0       0.0       0.0MECH
*SET_NODE_LIST_TITLE
Node set 4
         4       0.0       0.0       0.0       0.0MECH
*ELEMENT_SHELL
*NODE
*SECTION_SHELL
*SECTION_SHELL
*MAT_ENHANCED_COMPOSITE_DAMAGE_TITLE
Ply data   IM7/8551-7
*MAT_ELASTIC_TITLE
stiff ends
*PART
*PART
*PART
*PART
ends
*END