$# LS-DYNA Keyword file created by LS-PrePost(R) V4.6.1 - 04Dec2018
$# Created on Feb-14-2019 (10:05:41)
*KEYWORD
*TITLE
$#                                                                         title
Beam Tutorial
*CONTROL_IMPLICIT_AUTO
*CONTROL_IMPLICIT_GENERAL
*CONTROL_IMPLICIT_SOLUTION
*CONTROL_IMPLICIT_SOLVER
*CONTROL_TERMINATION
*DATABASE_BNDOUT
*DATABASE_ELOUT
*DATABASE_SECFORC
*DATABASE_SPCFORC
*DATABASE_EXTENT_BINARY
*DATABASE_HISTORY_NODE
*DATABASE_HISTORY_SHELL
*BOUNDARY_SPC_SET
*SET_NODE_LIST_TITLE
NODESET(SPC) 1
         1       0.0       0.0       0.0       0.0MECH
*BOUNDARY_SPC_SET
*SET_NODE_LIST
         2       0.0       0.0       0.0       0.0MECH
*DEFINE_CURVE
*INTEGRATION_SHELL
*SET_NODE_LIST_TITLE
Loads
         3       0.0       0.0       0.0       0.0MECH
*ELEMENT_SHELL
*NODE
*SECTION_SHELL_TITLE
Section: Used for all lamantes in beam
*SECTION_SHELL_TITLE
Section: for metal stiff ends
*MAT_ENHANCED_COMPOSITE_DAMAGE_TITLE
Ply data   IM7/8551-7
*MAT_ELASTIC_TITLE
stiff ends
*LOAD_NODE_SET
*PART
base flange
*PART
web
*PART
top flange
*PART
ends
*END