$# LS-DYNA Keyword file created by LS-PrePost(R) V4.6.1 - 04Dec2018
$# Created on Apr-10-2019 (11:30:19)
*KEYWORD
*TITLE
$#                                                                         title
LS-DYNA keyword deck by LS-PrePost
*CONTROL_TERMINATION
$#  endtim    endcyc     dtmin    endeng    endmas     nosol
*CONTROL_TIMESTEP
$#  dtinit    tssfac      isdo    tslimt     dt2ms      lctm     erode     ms1st
$#  dt2msf   dt2mslc     imscl    unused    unused     rmscl
*DATABASE_BNDOUT
$#      dt    binary      lcur     ioopt
*DATABASE_GLSTAT
$#      dt    binary      lcur     ioopt
*DATABASE_MATSUM
$#      dt    binary      lcur     ioopt
*DATABASE_SECFORC
$#      dt    binary      lcur     ioopt
*DATABASE_SPCFORC
$#      dt    binary      lcur     ioopt
*DATABASE_BINARY_D3PLOT
$#      dt      lcdt      beam     npltc    psetid
$#   ioopt
*BOUNDARY_PRESCRIBED_MOTION_SET_ID
$#      id                                                               heading
         1displacement
$#    nsid       dof       vad      lcid        sf       vid     death     birth
*BOUNDARY_SPC_SET_ID
$#      id                                                               heading
         1constrained end
$#    nsid       cid      dofx      dofy      dofz     dofrx     dofry     dofrz
*SET_NODE_LIST_TITLE
constrained end
$#     sid       da1       da2       da3       da4    solver
         4       0.0       0.0       0.0       0.0MECH
$#    nid1      nid2      nid3      nid4      nid5      nid6      nid7      nid8
*BOUNDARY_SPC_SET_ID
$#      id                                                               heading
         0constrained base
$#    nsid       cid      dofx      dofy      dofz     dofrx     dofry     dofrz
*SET_NODE_LIST_TITLE
NODESET(SPC) 7
$#     sid       da1       da2       da3       da4    solver
         7       0.0       0.0       0.0       0.0MECH
$#    nid1      nid2      nid3      nid4      nid5      nid6      nid7      nid8
*DEFINE_CURVE_TITLE
displacement
$#    lcid      sidr       sfa       sfo      offa      offo    dattyp     lcint
$#                a1                  o1
*SET_NODE_LIST_TITLE
for applied displacements
$#     sid       da1       da2       da3       da4    solver
         5       0.0       0.0       0.0       0.0MECH
$#    nid1      nid2      nid3      nid4      nid5      nid6      nid7      nid8
*SET_NODE_LIST_TITLE
constraint base
$#     sid       da1       da2       da3       da4    solver
         6       0.0       0.0       0.0       0.0MECH
$#    nid1      nid2      nid3      nid4      nid5      nid6      nid7      nid8
*ELEMENT_SOLID
$#   eid     pid      n1      n2      n3      n4      n5      n6      n7      n8
*NODE
$#   nid               x               y               z      tc      rc
*SECTION_SOLID_TITLE
warp, weft and matrix
$#   secid    elform       aet
*MAT_ENHANCED_COMPOSITE_DAMAGE_TITLE
warp
$#     mid        ro        ea        eb      (ec)      prba    (prca)    (prcb)
$#     gab       gbc       gca      (kf)      aopt      2way
$#      xp        yp        zp        a1        a2        a3    mangle
$#      v1        v2        v3        d1        d2        d3    dfailm    dfails
$#   tfail      alph      soft      fbrt     ycfac    dfailt    dfailc       efs
$#      xc        xt        yc        yt        sc      crit      beta
$#     pel      epsf      epsr      tsmd     soft2
$#  slimt1    slimc1    slimt2    slimc2     slims    ncyred     softg
*MAT_ENHANCED_COMPOSITE_DAMAGE_TITLE
weft
$#     mid        ro        ea        eb      (ec)      prba    (prca)    (prcb)
$#     gab       gbc       gca      (kf)      aopt      2way
$#      xp        yp        zp        a1        a2        a3    mangle
$#      v1        v2        v3        d1        d2        d3    dfailm    dfails
$#   tfail      alph      soft      fbrt     ycfac    dfailt    dfailc       efs
$#      xc        xt        yc        yt        sc      crit      beta
$#     pel      epsf      epsr      tsmd     soft2
$#  slimt1    slimc1    slimt2    slimc2     slims    ncyred     softg
*MAT_PIECEWISE_LINEAR_PLASTICITY_TITLE
Matrix
$#     mid        ro         e        pr      sigy      etan      fail      tdel
$#       c         p      lcss      lcsr        vp
$#    eps1      eps2      eps3      eps4      eps5      eps6      eps7      eps8
$#     es1       es2       es3       es4       es5       es6       es7       es8
*PART
$#                                                                         title
warp
$#     pid     secid       mid     eosid      hgid      grav    adpopt      tmid
*PART
$#                                                                         title
weft
$#     pid     secid       mid     eosid      hgid      grav    adpopt      tmid
*PART
$#                                                                         title
matrix
$#     pid     secid       mid     eosid      hgid      grav    adpopt      tmid
*END