$# LS-DYNA Keyword file created by LS-PrePost(R) V4.6.1 - 04Dec2018
$# Created on Apr-05-2019 (07:51:20)
*KEYWORD
*TITLE
$#                                                                         title
LS-DYNA keyword deck by LS-PrePost
*CONTROL_IMPLICIT_GENERAL
$#  imflag       dt0    imform      nsbs       igs     cnstn      form    zero_v
*CONTROL_IMPLICIT_SOLUTION
$#  nsolvr    ilimit    maxref     dctol     ectol     rctol     lstol    abstol
$#   dnorm    diverg     istif   nlprint    nlnorm   d3itctl     cpchk
$#  arcctl    arcdir    arclen    arcmth    arcdmp    arcpsi    arcalf    arctim
$#   lsmtd     lsdir      irad      srad      awgt      sred
*CONTROL_IMPLICIT_SOLVER
$#  lsolvr    lprint     negev     order      drcm    drcprm   autospc   autotol
$#  lcpack    mtxdmp    iparm1    rparm1    rparm2
$#  emxdmp    rdcmem
*CONTROL_TERMINATION
$#  endtim    endcyc     dtmin    endeng    endmas     nosol
*DATABASE_BNDOUT
$#      dt    binary      lcur     ioopt
*DATABASE_GLSTAT
$#      dt    binary      lcur     ioopt
*DATABASE_MATSUM
$#      dt    binary      lcur     ioopt
*DATABASE_SECFORC
$#      dt    binary      lcur     ioopt
*DATABASE_SPCFORC
$#      dt    binary      lcur     ioopt
*DATABASE_BINARY_D3PLOT
$#      dt      lcdt      beam     npltc    psetid
$#   ioopt
*BOUNDARY_PRESCRIBED_MOTION_SET_ID
$#      id                                                               heading
         1displacement
$#    nsid       dof       vad      lcid        sf       vid     death     birth
*BOUNDARY_SPC_SET_ID
$#      id                                                               heading
         1constrained end
$#    nsid       cid      dofx      dofy      dofz     dofrx     dofry     dofrz
*SET_NODE_LIST_TITLE
constrained end
$#     sid       da1       da2       da3       da4    solver
         4       0.0       0.0       0.0       0.0MECH
$#    nid1      nid2      nid3      nid4      nid5      nid6      nid7      nid8
*BOUNDARY_SPC_SET_ID
$#      id                                                               heading
         0constraint base
$#    nsid       cid      dofx      dofy      dofz     dofrx     dofry     dofrz
*SET_NODE_LIST_TITLE
constraint base
$#     sid       da1       da2       da3       da4    solver
         6       0.0       0.0       0.0       0.0MECH
$#    nid1      nid2      nid3      nid4      nid5      nid6      nid7      nid8
*DEFINE_CURVE_TITLE
displacement
$#    lcid      sidr       sfa       sfo      offa      offo    dattyp     lcint
$#                a1                  o1
*SET_NODE_LIST_TITLE
for applied displacements
$#     sid       da1       da2       da3       da4    solver
         5       0.0       0.0       0.0       0.0MECH
$#    nid1      nid2      nid3      nid4      nid5      nid6      nid7      nid8
*ELEMENT_SOLID
$#   eid     pid      n1      n2      n3      n4      n5      n6      n7      n8
*NODE
$#   nid               x               y               z      tc      rc
*SECTION_SOLID_TITLE
warp, weft and matrix
$#   secid    elform       aet
*MAT_ENHANCED_COMPOSITE_DAMAGE_TITLE
warp
$#     mid        ro        ea        eb      (ec)      prba    (prca)    (prcb)
$#     gab       gbc       gca      (kf)      aopt      2way
$#      xp        yp        zp        a1        a2        a3    mangle
$#      v1        v2        v3        d1        d2        d3    dfailm    dfails
$#   tfail      alph      soft      fbrt     ycfac    dfailt    dfailc       efs
$#      xc        xt        yc        yt        sc      crit      beta
$#     pel      epsf      epsr      tsmd     soft2
$#  slimt1    slimc1    slimt2    slimc2     slims    ncyred     softg
*MAT_ENHANCED_COMPOSITE_DAMAGE_TITLE
weft
$#     mid        ro        ea        eb      (ec)      prba    (prca)    (prcb)
$#     gab       gbc       gca      (kf)      aopt      2way
$#      xp        yp        zp        a1        a2        a3    mangle
$#      v1        v2        v3        d1        d2        d3    dfailm    dfails
$#   tfail      alph      soft      fbrt     ycfac    dfailt    dfailc       efs
$#      xc        xt        yc        yt        sc      crit      beta
$#     pel      epsf      epsr      tsmd     soft2
$#  slimt1    slimc1    slimt2    slimc2     slims    ncyred     softg
*MAT_ELASTIC_TITLE
Matrix
$#     mid        ro         e        pr        da        db  not used
*PART
$#                                                                         title
warp
$#     pid     secid       mid     eosid      hgid      grav    adpopt      tmid
*PART
$#                                                                         title
weft
$#     pid     secid       mid     eosid      hgid      grav    adpopt      tmid
*PART
$#                                                                         title
matrix
$#     pid     secid       mid     eosid      hgid      grav    adpopt      tmid
*END